Reaction Details
TargetAldehyde dehydrogenase 1A1
LigandBDBM30972
Substrate/Competitorn/a
Meas. Tech.ChEMBL_1473981 (CHEMBL3419577)
Ki 800±n/a nM
Citation Morgan, CAHurley, TD Characterization of two distinct structural classes of selective aldehyde dehydrogenase 1A1 inhibitors. J Med Chem58:1964-75 (2015) 
 
Aldehyde dehydrogenase 1A1
Name:Aldehyde dehydrogenase 1A1
Type:Protein
Mol. Mass.:54862.21
Organism:Homo sapiens (Human)
Description:n/a
Residue:501
BDBM30972
NameBDBM30972
Synonyms:8-[[4-(2-furoyl)piperazino]methyl]-7-isoamyl-1,3-dimethyl-xanthine 8-[[4-(furan-2-ylcarbonyl)piperazin-1-yl]methyl]-1,3-dimethyl-7-(3-methylbutyl)purine-2,6-dione MLS000101916 cid_4894361
TypeSmall organic molecule
Emp. Form.C22H30N6O4
Mol. Mass.442.5114
SMILESCC(C)CCn1c(CN2CCN(CC2)C(=O)c2ccco2)nc2n(C)c(=O)n(C)c(=O)c12