Reaction Details
TargetAldehyde dehydrogenase X, mitochondrial
LigandBDBM50076740
Substrate/Competitorn/a
Meas. Tech.ChEMBL_1473083 (CHEMBL3421193)
IC50>100000±n/a nM
Citation Morgan, CAHurley, TD Characterization of two distinct structural classes of selective aldehyde dehydrogenase 1A1 inhibitors. J Med Chem58:1964-75 (2015) 
 
Aldehyde dehydrogenase X, mitochondrial
Name:Aldehyde dehydrogenase X, mitochondrial
Type:PROTEIN
Mol. Mass.:57207.14
Organism:Homo sapiens (Human)
Description:ChEMBL_109700
Residue:517
BDBM50076740
NameBDBM50076740
Synonyms:CHEMBL1382328
TypeSmall organic molecule
Emp. Form.C23H30N6O3
Mol. Mass.438.5227
SMILESCn1c2nc(CN3CCC(CC3)C(N)=O)n(CCCc3ccccc3)c2c(=O)n(C)c1=O