Reaction Details
TargetSphingosine kinase 1
LigandBDBM50343829
Substrate/Competitorn/a
Meas. Tech.ChEMBL_1474026 (CHEMBL3419997)
Ki 130±n/a nM
Citation Patwardhan, NNMorris, EAKharel, YRaje, MRGao, MTomsig, JLLynch, KRSantos, WL Structure-activity relationship studies and in vivo activity of guanidine-based sphingosine kinase inhibitors: discovery of SphK1- and SphK2-selective inhibitors. J Med Chem58:1879-99 (2015) 
 
Sphingosine kinase 1
Name:Sphingosine kinase 1
Type:Enzyme
Mol. Mass.:42521.16
Organism:Homo sapiens (Human)
Description:Q9NYA1
Residue:384
BDBM50343829
NameBDBM50343829
Synonyms:(S)-1-(4-Dodecylbenzoyl)pyrrolidine-2-carboximidamide Hydrochloride | CHEMBL1774571
TypeSmall organic molecule
Emp. Form.C24H39N3O
Mol. Mass.385.586
SMILESCCCCCCCCCCCCc1ccc(cc1)C(=O)N1CCC[C@H]1C(N)=N