Reaction Details
TargetSphingosine kinase 2
LigandBDBM50393642
Substrate/Competitorn/a
Meas. Tech.ChEMBL_1474027 (CHEMBL3419998)
Ki 9800±n/a nM
Citation Patwardhan, NNMorris, EAKharel, YRaje, MRGao, MTomsig, JLLynch, KRSantos, WL Structure-activity relationship studies and in vivo activity of guanidine-based sphingosine kinase inhibitors: discovery of SphK1- and SphK2-selective inhibitors. J Med Chem58:1879-99 (2015) 
 
Sphingosine kinase 2
Name:Sphingosine kinase 2
Type:Protein
Mol. Mass.:69221.44
Organism:Homo sapiens (Human)
Description:Q9NRA0
Residue:654
BDBM50393642
NameBDBM50393642
Synonyms:CHEMBL2158685
TypeSmall organic molecule
Emp. Form.C23H25ClN2O
Mol. Mass.380.91
SMILESClc1ccc(cc1)C12CC3CC(CC(C3)(C1)C(=O)NCc1ccncc1)C2