Reaction Details
TargetAdenosine receptor A2b
LigandBDBM50078420
Substrate/Competitorn/a
Meas. Tech.ChEMBL_1471050 (CHEMBL3420495)
EC50 1110±n/a nM
Citation Petrelli, RTorquati, IKachler, SLuongo, LMaione, SFranchetti, PGrifantini, MNovellino, ELavecchia, AKlotz, KNCappellacci, L 5'-C-Ethyl-tetrazolyl-N(6)-substituted adenosine and 2-chloro-adenosine derivatives as highly potent dual acting A1 adenosine receptor agonists and A3 adenosine receptor antagonists. J Med Chem58:2560-6 (2015) 
 
Adenosine receptor A2b
Name:Adenosine receptor A2b
Type:G Protein-Coupled Receptor (GPCR)
Mol. Mass.:36341.22
Organism:Homo sapiens (Human)
Description:n/a
Residue:332
BDBM50078420
NameBDBM50078420
Synonyms:CHEMBL3414947
TypeSmall organic molecule
Emp. Form.C18H16Cl2FN9O3
Mol. Mass.496.283
SMILESCCn1nnc(n1)[C@H]1O[C@H]([C@H](O)[C@@H]1O)n1cnc2c(Nc3ccc(Cl)cc3F)nc(Cl)nc12