Reaction Details
TargetAdenosine receptor A3
LigandBDBM50078425
Substrate/Competitorn/a
Meas. Tech.ChEMBL_1471051 (CHEMBL3420496)
EC50 7.7±n/a nM
Citation Petrelli, RTorquati, IKachler, SLuongo, LMaione, SFranchetti, PGrifantini, MNovellino, ELavecchia, AKlotz, KNCappellacci, L 5'-C-Ethyl-tetrazolyl-N(6)-substituted adenosine and 2-chloro-adenosine derivatives as highly potent dual acting A1 adenosine receptor agonists and A3 adenosine receptor antagonists. J Med Chem58:2560-6 (2015) 
 
Adenosine receptor A3
Name:Adenosine receptor A3
Type:G Protein-Coupled Receptor (GPCR)
Mol. Mass.:36197.32
Organism:Homo sapiens (Human)
Description:P0DMS8
Residue:318
BDBM50078425
NameBDBM50078425
Synonyms:CHEMBL3414939
TypeSmall organic molecule
Emp. Form.C13H16ClN9O3
Mol. Mass.381.778
SMILESCCn1nnc(n1)[C@H]1O[C@H]([C@H](O)[C@@H]1O)n1cnc2c(NC)nc(Cl)nc12