Reaction Details
TargetCarbonic anhydrase 2
LigandBDBM50078642
Substrate/Competitorn/a
Meas. Tech.ChEMBL_1471415 (CHEMBL3419422)
IC50 165±n/a nM
Citation Huang, QRui, EYCobbs, MDinh, DMGukasyan, HJLafontaine, JAMehta, SPatterson, BDRewolinski, DARichardson, PFEdwards, MP Design, synthesis, and evaluation of NO-donor containing carbonic anhydrase inhibitors to lower intraocular pressure. J Med Chem58:2821-33 (2015) 
 
Carbonic anhydrase 2
Name:Carbonic anhydrase 2
Type:Enzyme
Mol. Mass.:29250.71
Organism:Homo sapiens (Human)
Description:P00918
Residue:260
BDBM50078642
NameBDBM50078642
Synonyms:CHEMBL3415384
TypeSmall organic molecule
Emp. Form.C11H19N3O5S3
Mol. Mass.369.481
SMILESCCN[C@H]1CN(CCCO)S(=O)(=O)c2sc(cc12)S(N)(=O)=O