Reaction Details
TargetCarbonic anhydrase 2
LigandBDBM10885
Substrate/Competitorn/a
Meas. Tech.ChEMBL_1471414 (CHEMBL3419421)
Kd 0.089000±n/a nM
Citation Huang, QRui, EYCobbs, MDinh, DMGukasyan, HJLafontaine, JAMehta, SPatterson, BDRewolinski, DARichardson, PFEdwards, MP Design, synthesis, and evaluation of NO-donor containing carbonic anhydrase inhibitors to lower intraocular pressure. J Med Chem58:2821-33 (2015) 
 
Carbonic anhydrase 2
Name:Carbonic anhydrase 2
Type:Enzyme
Mol. Mass.:29250.71
Organism:Homo sapiens (Human)
Description:P00918
Residue:260
BDBM10885
NameBDBM10885
Synonyms:(4R)-4-(ethylamino)-2-(3-methoxypropyl)-1,1-dioxo-2H,3H,4H-1,7,2-thieno[3,2-e][1,2]thiazine-6-sulfonamide AL-4862 Brinzolamide (BRZ) | brinzolamide
TypeSmall organic molecule
Emp. Form.C12H21N3O5S3
Mol. Mass.383.507
SMILESCCN[C@H]1CN(CCCOC)S(=O)(=O)c2sc(cc12)S(N)(=O)=O