Reaction Details
TargetCarbonic anhydrase 2
LigandBDBM50078672
Substrate/Competitorn/a
Meas. Tech.ChEMBL_1471414 (CHEMBL3419421)
Kd 0.083000±n/a nM
Citation Huang, QRui, EYCobbs, MDinh, DMGukasyan, HJLafontaine, JAMehta, SPatterson, BDRewolinski, DARichardson, PFEdwards, MP Design, synthesis, and evaluation of NO-donor containing carbonic anhydrase inhibitors to lower intraocular pressure. J Med Chem58:2821-33 (2015) 
 
Carbonic anhydrase 2
Name:Carbonic anhydrase 2
Type:Enzyme
Mol. Mass.:29250.71
Organism:Homo sapiens (Human)
Description:P00918
Residue:260
BDBM50078672
NameBDBM50078672
Synonyms:CHEMBL3415379
TypeSmall organic molecule
Emp. Form.C12H19N3O7S3
Mol. Mass.413.49
SMILESCCN[C@H]1C[C@H](CCCO[N+]([O-])=O)S(=O)(=O)c2sc(cc12)S(N)(=O)=O