Reaction Details
TargetCannabinoid receptor 1
LigandBDBM50078770
Substrate/Competitorn/a
Meas. Tech.ChEMBL_1472323 (CHEMBL3419673)
Ki 4.4±n/a nM
Citation Ogawa, GTius, MAZhou, HNikas, SPHalikhedkar, AMallipeddi, SMakriyannis, A 3'-functionalized adamantyl cannabinoid receptor probes. J Med Chem58:3104-16 (2015) 
 
Cannabinoid receptor 1
Name:Cannabinoid receptor 1
Type:G Protein-Coupled Receptor (GPCR)
Mol. Mass.:52856.55
Organism:Rattus norvegicus (rat)
Description:P20272
Residue:473
BDBM50078770
NameBDBM50078770
Synonyms:CHEMBL3416129
TypeSmall organic molecule
Emp. Form.C26H35N3O3
Mol. Mass.437.5744
SMILES[H][C@@]12C[C@H](O)CC[C@@]1([H])C(C)(C)Oc1cc(cc(O)c21)[C@]12CC3CC(C[C@@](CN=[N+]=[N-])(C3)C1)C2