Reaction Details
TargetAdenosine receptor A1
LigandBDBM50079354
Substrate/Competitorn/a
Meas. Tech.ChEMBL_1472820 (CHEMBL3419482)
Ki 3.6±n/a nM
Citation Preti, DBaraldi, PGSaponaro, GRomagnoli, RAghazadeh Tabrizi, MBaraldi, SCosconati, SBruno, ANovellino, EVincenzi, FRavani, ABorea, PAVarani, K Design, synthesis, and biological evaluation of novel 2-((2-(4-(substituted)phenylpiperazin-1-yl)ethyl)amino)-5'-N-ethylcarboxamidoadenosines as potent and selective agonists of the A2A adenosine receptor. J Med Chem58:3253-67 (2015) 
 
Adenosine receptor A1
Name:Adenosine receptor A1
Type:G Protein-Coupled Receptor (GPCR)
Mol. Mass.:36520.92
Organism:Homo sapiens (Human)
Description:P30542
Residue:326
BDBM50079354
NameBDBM50079354
Synonyms:CHEMBL3416810
TypeSmall organic molecule
Emp. Form.C31H38N8O5
Mol. Mass.602.684
SMILESCCNC(=O)[C@H]1O[C@H]([C@H](O)[C@@H]1O)n1cnc2c(N)nc(nc12)N1CCN(CC1)c1ccc(OCCCc2ccccc2)cc1