Reaction Details
TargetSodium-dependent dopamine transporter
LigandBDBM50079576
Substrate/Competitorn/a
Meas. Tech.ChEMBL_1471699 (CHEMBL3421067)
Ki 10200±n/a nM
Citation Hudkins, RLBecknell, NCLyons, JAAimone, LDOlsen, MHaltiwanger, RCMathiasen, JRRaddatz, RGruner, JA 3,4-Diaza-bicyclo[4.1.0]hept-4-en-2-one phenoxypropylamine analogs of irdabisant (CEP-26401) as potent histamine-3 receptor inverse agonists with robust wake-promoting activity. Eur J Med Chem95:349-56 (2015) 
 
Sodium-dependent dopamine transporter
Name:Sodium-dependent dopamine transporter
Type:Multi-pass membrane protein
Mol. Mass.:68497.11
Organism:Homo sapiens (Human)
Description:Q01959
Residue:620
BDBM50079576
NameBDBM50079576
Synonyms:CHEMBL3417585
TypeSmall organic molecule
Emp. Form.C19H25N3O2
Mol. Mass.327.4207
SMILES[H][C@@]12C[C@]1([H])C(=NNC2=O)c1ccc(OCCCN2CCC[C@H]2C)cc1