Reaction Details
TargetMatrix protein 2 [1-96]
LigandBDBM50079995
Substrate/Competitorn/a
Meas. Tech.ChEMBL_1471014 (CHEMBL3420061)
IC50 2600±n/a nM
Citation Rey-Carrizo, MGazzarrini, SLlabrés, SFrigolé-Vivas, MJuárez-Jiménez, JFont-Bardia, MNaesens, LMoroni, ALuque, FJVázquez, S New polycyclic dual inhibitors of the wild type and the V27A mutant M2 channel of the influenza A virus with unexpected binding mode. Eur J Med Chem96:318-29 (2015) 
 
Matrix protein 2 [1-96]
Name:Matrix protein 2 [1-96]
Type:PROTEIN
Mol. Mass.:11051.96
Organism:Influenza A virus
Description:ChEMBL_1453980
Residue:96
BDBM50079995
NameBDBM50079995
Synonyms:CHEMBL3415947
TypeSmall organic molecule
Emp. Form.C16H19N
Mol. Mass.225.3288
SMILES[H][C@]12[C@@]3([H])[C@@]4([H])[C@@]1([H])[C@]1([H])[C@@]5([H])CNC[C@@]5([H])[C@@]4([H])[C@@]4([H])[C@]3([H])C=C[C@]2([H])[C@@]14[H]