Reaction Details
TargetCarbonic anhydrase 2
LigandBDBM50437929
Substrate/Competitorn/a
Meas. Tech.ChEMBL_1471327 (CHEMBL3418803)
Ki>10000±n/a nM
Citation Awadallah, FMEl-Waei, TAHanna, MMAbbas, SECeruso, MOz, BEGuler, OOSupuran, CT Synthesis, carbonic anhydrase inhibition and cytotoxic activity of novel chromone-based sulfonamide derivatives. Eur J Med Chem96:425-35 (2015) 
 
Carbonic anhydrase 2
Name:Carbonic anhydrase 2
Type:Enzyme
Mol. Mass.:29250.71
Organism:Homo sapiens (Human)
Description:P00918
Residue:260
BDBM50437929
NameBDBM50437929
Synonyms:CHEMBL2408560
TypeSmall organic molecule
Emp. Form.C23H21N3O5S
Mol. Mass.451.495
SMILESCCOC1Oc2ccccc2C(=O)C1=CNc1ccc(cc1)S(=O)(=O)Nc1ccccn1