Reaction Details
TargetCarbonic anhydrase 9
LigandBDBM50437929
Substrate/Competitorn/a
Meas. Tech.ChEMBL_1471328 (CHEMBL3418804)
Ki 21±n/a nM
Citation Awadallah, FMEl-Waei, TAHanna, MMAbbas, SECeruso, MOz, BEGuler, OOSupuran, CT Synthesis, carbonic anhydrase inhibition and cytotoxic activity of novel chromone-based sulfonamide derivatives. Eur J Med Chem96:425-35 (2015) 
 
Carbonic anhydrase 9
Name:Carbonic anhydrase 9
Type:Enzyme
Mol. Mass.:49669.03
Organism:Homo sapiens (Human)
Description:Catalytic domain of human cloned isozyme was used in the assay
Residue:459
BDBM50437929
NameBDBM50437929
Synonyms:CHEMBL2408560
TypeSmall organic molecule
Emp. Form.C23H21N3O5S
Mol. Mass.451.495
SMILESCCOC1Oc2ccccc2C(=O)C1=CNc1ccc(cc1)S(=O)(=O)Nc1ccccn1