Reaction Details
TargetCarbonic anhydrase 9
LigandBDBM50080152
Substrate/Competitorn/a
Meas. Tech.ChEMBL_1471328 (CHEMBL3418804)
Ki 32±n/a nM
Citation Awadallah, FMEl-Waei, TAHanna, MMAbbas, SECeruso, MOz, BEGuler, OOSupuran, CT Synthesis, carbonic anhydrase inhibition and cytotoxic activity of novel chromone-based sulfonamide derivatives. Eur J Med Chem96:425-35 (2015) 
 
Carbonic anhydrase 9
Name:Carbonic anhydrase 9
Type:Enzyme
Mol. Mass.:49669.03
Organism:Homo sapiens (Human)
Description:Catalytic domain of human cloned isozyme was used in the assay
Residue:459
BDBM50080152
NameBDBM50080152
Synonyms:CHEMBL3416230
TypeSmall organic molecule
Emp. Form.C20H17N3O5S
Mol. Mass.411.431
SMILESCc1cc(NS(=O)(=O)c2ccc(NCc3coc4ccccc4c3=O)cc2)no1