Reaction Details
TargetCarbonic anhydrase 12
LigandBDBM50080151
Substrate/Competitorn/a
Meas. Tech.ChEMBL_1471329 (CHEMBL3418805)
Ki 4.5±n/a nM
Citation Awadallah, FMEl-Waei, TAHanna, MMAbbas, SECeruso, MOz, BEGuler, OOSupuran, CT Synthesis, carbonic anhydrase inhibition and cytotoxic activity of novel chromone-based sulfonamide derivatives. Eur J Med Chem96:425-35 (2015) 
 
Carbonic anhydrase 12
Name:Carbonic anhydrase 12
Type:Enzyme
Mol. Mass.:39456.00
Organism:Homo sapiens (Human)
Description:Catalytic domain of human cloned isozyme was used in the assay
Residue:354
BDBM50080151
NameBDBM50080151
Synonyms:CHEMBL3040927
TypeSmall organic molecule
Emp. Form.C16H14N2O4S
Mol. Mass.330.358
SMILESNS(=O)(=O)c1ccc(NCc2coc3ccccc3c2=O)cc1