Reaction Details
TargetCarbonic anhydrase 12
LigandBDBM50080145
Substrate/Competitorn/a
Meas. Tech.ChEMBL_1471329 (CHEMBL3418805)
Ki 5.2±n/a nM
Citation Awadallah, FMEl-Waei, TAHanna, MMAbbas, SECeruso, MOz, BEGuler, OOSupuran, CT Synthesis, carbonic anhydrase inhibition and cytotoxic activity of novel chromone-based sulfonamide derivatives. Eur J Med Chem96:425-35 (2015) 
 
Carbonic anhydrase 12
Name:Carbonic anhydrase 12
Type:Enzyme
Mol. Mass.:39456.00
Organism:Homo sapiens (Human)
Description:Catalytic domain of human cloned isozyme was used in the assay
Residue:354
BDBM50080145
NameBDBM50080145
Synonyms:CHEMBL3416241
TypeSmall organic molecule
Emp. Form.C25H17N3O5S
Mol. Mass.471.485
SMILESNS(=O)(=O)c1ccc(cc1)N1C(=O)\C(=C\c2coc3ccccc3c2=O)N=C1c1ccccc1