Reaction Details
TargetCarbonic anhydrase 1
LigandBDBM50080154
Substrate/Competitorn/a
Meas. Tech.ChEMBL_1471326 (CHEMBL3418802)
Ki 399±n/a nM
Citation Awadallah, FMEl-Waei, TAHanna, MMAbbas, SECeruso, MOz, BEGuler, OOSupuran, CT Synthesis, carbonic anhydrase inhibition and cytotoxic activity of novel chromone-based sulfonamide derivatives. Eur J Med Chem96:425-35 (2015) 
 
Carbonic anhydrase 1
Name:Carbonic anhydrase 1
Type:Enzyme
Mol. Mass.:28873.37
Organism:Homo sapiens (Human)
Description:P00915
Residue:261
BDBM50080154
NameBDBM50080154
Synonyms:CHEMBL3416235
TypeSmall organic molecule
Emp. Form.C19H13N3O5S2
Mol. Mass.427.454
SMILESNS(=O)(=O)c1ccc(NC2=NC(=O)\C(S2)=C/c2coc3ccccc3c2=O)cc1