Reaction Details
TargetCarbonic anhydrase 1
LigandBDBM50080150
Substrate/Competitorn/a
Meas. Tech.ChEMBL_1471326 (CHEMBL3418802)
Ki>10000±n/a nM
Citation Awadallah, FMEl-Waei, TAHanna, MMAbbas, SECeruso, MOz, BEGuler, OOSupuran, CT Synthesis, carbonic anhydrase inhibition and cytotoxic activity of novel chromone-based sulfonamide derivatives. Eur J Med Chem96:425-35 (2015) 
 
Carbonic anhydrase 1
Name:Carbonic anhydrase 1
Type:Enzyme
Mol. Mass.:28873.37
Organism:Homo sapiens (Human)
Description:P00915
Residue:261
BDBM50080150
NameBDBM50080150
Synonyms:CHEMBL3416229
TypeSmall organic molecule
Emp. Form.C21H19N3O5S2
Mol. Mass.457.523
SMILESCCOC1Oc2ccccc2C(=O)\C1=C\Nc1ccc(cc1)S(=O)(=O)Nc1nccs1