Reaction Details
TargetNeuromedin-K receptor
LigandBDBM50051293
Substrate/Competitorn/a
Meas. Tech.ChEMBL_1475775 (CHEMBL3425008)
Ki 200±n/a nM
Citation Hoveyda, HRFraser, GLRoy, MODutheuil, GBatt, FEl Bousmaqui, MKorac, JLenoir, FLapin, ANoël, SBlanc, S Discovery and optimization of novel antagonists to the human neurokinin-3 receptor for the treatment of sex-hormone disorders (Part I). J Med Chem58:3060-82 (2015) 
 
Neuromedin-K receptor
Name:Neuromedin-K receptor
Type:n/a
Mol. Mass.:51128.60
Organism:Rattus norvegicus
Description:ChEMBL_10983
Residue:452
BDBM50051293
NameBDBM50051293
Synonyms:(S)-(-)-N-(R-ethylbenzyl)-3-hydroxy-2-phenylquinoline-4-carboxamide 3-Hydroxy-2-phenyl-quinoline-4-carboxylic acid (1-phenyl-propyl)-amide SB 223412 SB-223412 | Talnetant
TypeSmall organic molecule
Emp. Form.C25H22N2O2
Mol. Mass.382.4544
SMILESCC[C@H](NC(=O)c1c(O)c(nc2ccccc12)-c1ccccc1)c1ccccc1