Reaction Details
TargetCytochrome P450 3A4
LigandBDBM50081468
Substrate/Competitorn/a
Meas. Tech.ChEMBL_1474033 (CHEMBL3423891)
Ki 1640±n/a nM
Citation Lv, WLiu, JSkaar, TCFlockhart, DACushman, M Design and synthesis of norendoxifen analogues with dual aromatase inhibitory and estrogen receptor modulatory activities. J Med Chem58:2623-48 (2015) 
 
Cytochrome P450 3A4
Name:Cytochrome P450 3A4
Type:Enzyme
Mol. Mass.:57349.57
Organism:Homo sapiens (Human)
Description:n/a
Residue:503
BDBM50081468
NameBDBM50081468
Synonyms:CHEMBL3422028
TypeSmall organic molecule
Emp. Form.C24H25NO3
Mol. Mass.375.4602
SMILESCC\C(=C(\c1ccc(O)cc1)c1ccc(OCCN)cc1)c1ccc(O)cc1