Reaction Details
TargetGenome polyprotein
LigandBDBM50081635
Substrate/Competitorn/a
Meas. Tech.ChEMBL_1474191 (CHEMBL3424209)
IC50 19±n/a nM
Citation Zhao, FLiu, NZhan, PJiang, XLiu, X Discovery of HCV NS5B thumb site I inhibitors: core-refining from benzimidazole to indole scaffold. Eur J Med Chem94:218-28 (2015) 
 
Genome polyprotein
Name:Genome polyprotein
Type:Protein
Mol. Mass.:327252.46
Organism:Hepatitis C virus genotype 1b (isolate BK) (HCV)
Description:P26663
Residue:3010
BDBM50081635
NameBDBM50081635
Synonyms:CHEMBL3422107
TypeSmall organic molecule
Emp. Form.C29H37N3O2S
Mol. Mass.491.688
SMILESCC(C)N1CC[C@H](C1)N1CCn2c(c(C3CCCCC3)c3sc(cc23)C(O)=O)-c2ccccc2C1