Reaction Details
TargetCoagulation factor XIII A chain
LigandBDBM50083726
Substrate/Competitorn/a
Meas. Tech.ChEMBL_1475035 (CHEMBL3424606)
IC50 48±n/a nM
Citation Avery, CAPease, RJSmith, KBoothby, MBuckley, HMGrant, PJFishwick, CW (±) cis-Bisamido epoxides: A novel series of potent FXIII-A inhibitors. Eur J Med Chem98:49-53 (2015) 
 
Coagulation factor XIII A chain
Name:Coagulation factor XIII A chain
Type:PROTEIN
Mol. Mass.:83261.29
Organism:Homo sapiens (Human)
Description:ChEMBL_1475048
Residue:732
BDBM50083726
NameBDBM50083726
Synonyms:CHEMBL3423194
TypeSmall organic molecule
Emp. Form.C10H9ClN2O3
Mol. Mass.240.643
SMILESNC(=O)[C@H]1O[C@H]1C(=O)Nc1cccc(Cl)c1