Reaction Details
TargetProtein-glutamine gamma-glutamyltransferase 2
LigandBDBM50083721
Substrate/Competitorn/a
Meas. Tech.ChEMBL_1475047 (CHEMBL3424618)
IC50 130±n/a nM
Citation Avery, CAPease, RJSmith, KBoothby, MBuckley, HMGrant, PJFishwick, CW (±) cis-Bisamido epoxides: A novel series of potent FXIII-A inhibitors. Eur J Med Chem98:49-53 (2015) 
 
Protein-glutamine gamma-glutamyltransferase 2
Name:Protein-glutamine gamma-glutamyltransferase 2
Type:Protein
Mol. Mass.:77309.30
Organism:Homo sapiens (Human)
Description:P21980
Residue:687
BDBM50083721
NameBDBM50083721
Synonyms:CHEMBL3423199
TypeSmall organic molecule
Emp. Form.C12H14N2O3
Mol. Mass.234.2512
SMILESCc1ccc(NC(=O)[C@H]2O[C@H]2C(N)=O)cc1C