Reaction Details
TargetProtein-glutamine gamma-glutamyltransferase 2
LigandBDBM50083717
Substrate/Competitorn/a
Meas. Tech.ChEMBL_1475047 (CHEMBL3424618)
IC50 150±n/a nM
Citation Avery, CAPease, RJSmith, KBoothby, MBuckley, HMGrant, PJFishwick, CW (±) cis-Bisamido epoxides: A novel series of potent FXIII-A inhibitors. Eur J Med Chem98:49-53 (2015) 
 
Protein-glutamine gamma-glutamyltransferase 2
Name:Protein-glutamine gamma-glutamyltransferase 2
Type:Protein
Mol. Mass.:77309.30
Organism:Homo sapiens (Human)
Description:P21980
Residue:687
BDBM50083717
NameBDBM50083717
Synonyms:CHEMBL3423203
TypeSmall organic molecule
Emp. Form.C23H18FN3O5
Mol. Mass.435.4045
SMILESNC(=O)[C@@H]1O[C@@H]1C(=O)Nc1ccc(Oc2ccc(NC(=O)c3ccc(F)cc3)cc2)cc1