Reaction Details
TargetOrexin receptor type 2
LigandBDBM50084396
Substrate/Competitorn/a
Meas. Tech.ChEMBL_1477381 (CHEMBL3429483)
Ki 0.400000±n/a nM
Citation Kuduk, SDSkudlarek, JWDiMarco, CNBruno, JGPausch, MHO'Brien, JACabalu, TDStevens, JBrunner, JTannenbaum, PLGarson, SLSavitz, ATHarrell, CMGotter, ALWinrow, CJRenger, JJColeman, PJ Identification of MK-8133: An orexin-2 selective receptor antagonist with favorable development properties. Bioorg Med Chem Lett25:2488-92 (2015) 
 
Orexin receptor type 2
Name:Orexin receptor type 2
Type:Protein
Mol. Mass.:50710.53
Organism:Homo sapiens (Human)
Description:O43614
Residue:444
BDBM50084396
NameBDBM50084396
Synonyms:CHEMBL3426143
TypeSmall organic molecule
Emp. Form.C20H20IN5O2
Mol. Mass.489.3096
SMILESC[C@@H]1CC[C@H](CN1C(=O)c1ccccc1-n1nccn1)Oc1cc(I)ccn1