Reaction Details
TargetCell division protein FtsZ
LigandBDBM50086201
Substrate/Competitorn/a
Meas. Tech.ChEMBL_1477924 (CHEMBL3429345)
IC50 28000±n/a nM
Citation Nepomuceno, GMChan, KMHuynh, VMartin, KSMoore, JTO'Brien, TEPollo, LASarabia, FJTadeus, CYao, ZAnderson, DEAmes, JBShaw, JT Synthesis and Evaluation of Quinazolines as Inhibitors of the Bacterial Cell Division Protein FtsZ. ACS Med Chem Lett6:308-12 (2015) 
 
Cell division protein FtsZ
Name:Cell division protein FtsZ
Type:Protein
Mol. Mass.:40305.83
Organism:Escherichia coli
Description:P0A9A6
Residue:383
BDBM50086201
NameBDBM50086201
Synonyms:CHEMBL3425611
TypeSmall organic molecule
Emp. Form.C26H25ClN4
Mol. Mass.428.957
SMILESCN(C)CCNc1nc(\C=C\c2ccc(Cl)cc2)nc2ccc(cc12)-c1ccccc1