Reaction Details
TargetCatechol O-methyltransferase
LigandBDBM50086213
Substrate/Competitorn/a
Meas. Tech.ChEMBL_1477937 (CHEMBL3429504)
IC50 16±n/a nM
Citation Harrison, STPoslusney, MSMulhearn, JJZhao, ZKett, NRSchubert, JWMelamed, JYAllison, TJPatel, SBSanders, JMSharma, SSmith, RFHall, DLRobinson, RGSachs, NAHutson, PHWolkenberg, SEBarrow, JC Synthesis and Evaluation of Heterocyclic Catechol Mimics as Inhibitors of Catechol-O-methyltransferase (COMT). ACS Med Chem Lett6:318-23 (2015) 
 
Catechol O-methyltransferase
Name:Catechol O-methyltransferase
Type:Enzyme
Mol. Mass.:29594.09
Organism:Rattus norvegicus (Rat)
Description:n/a
Residue:264
BDBM50086213
NameBDBM50086213
Synonyms:CHEMBL3425734
TypeSmall organic molecule
Emp. Form.C17H13NO2
Mol. Mass.263.2906
SMILESOc1cn(ccc1=O)-c1cccc(c1)-c1ccccc1