Reaction Details
TargetCatechol O-methyltransferase
LigandBDBM50086221
Substrate/Competitorn/a
Meas. Tech.ChEMBL_1477936 (CHEMBL3429503)
IC50 140±n/a nM
Citation Harrison, STPoslusney, MSMulhearn, JJZhao, ZKett, NRSchubert, JWMelamed, JYAllison, TJPatel, SBSanders, JMSharma, SSmith, RFHall, DLRobinson, RGSachs, NAHutson, PHWolkenberg, SEBarrow, JC Synthesis and Evaluation of Heterocyclic Catechol Mimics as Inhibitors of Catechol-O-methyltransferase (COMT). ACS Med Chem Lett6:318-23 (2015) 
 
Catechol O-methyltransferase
Name:Catechol O-methyltransferase
Type:Enzyme
Mol. Mass.:30030.67
Organism:Homo sapiens (Human)
Description:P21964
Residue:271
BDBM50086221
NameBDBM50086221
Synonyms:CHEMBL3425733
TypeSmall organic molecule
Emp. Form.C18H15NO3
Mol. Mass.293.3166
SMILESOCc1cc(=O)c(O)cn1-c1cccc(c1)-c1ccccc1