Reaction Details
TargetCatechol O-methyltransferase
LigandBDBM50086215
Substrate/Competitorn/a
Meas. Tech.ChEMBL_1477937 (CHEMBL3429504)
IC50 1000±n/a nM
Citation Harrison, STPoslusney, MSMulhearn, JJZhao, ZKett, NRSchubert, JWMelamed, JYAllison, TJPatel, SBSanders, JMSharma, SSmith, RFHall, DLRobinson, RGSachs, NAHutson, PHWolkenberg, SEBarrow, JC Synthesis and Evaluation of Heterocyclic Catechol Mimics as Inhibitors of Catechol-O-methyltransferase (COMT). ACS Med Chem Lett6:318-23 (2015) 
 
Catechol O-methyltransferase
Name:Catechol O-methyltransferase
Type:Enzyme
Mol. Mass.:29594.09
Organism:Rattus norvegicus (Rat)
Description:n/a
Residue:264
BDBM50086215
NameBDBM50086215
Synonyms:CHEMBL3425743 | US9260413, Example 3
TypeSmall organic molecule
Emp. Form.C17H14N2O2
Mol. Mass.278.3053
SMILESCn1c(ncc(O)c1=O)-c1cccc(c1)-c1ccccc1