Reaction Details
Target5-hydroxytryptamine receptor 2C
LigandBDBM50086247
Substrate/Competitorn/a
Meas. Tech.ChEMBL_1477947 (CHEMBL936420)
Ki 12±n/a nM
Citation Rouquet, GMoore, DESpain, MAllwood, DMBattilocchio, CBlakemore, DCFish, PVJenkinson, SJessiman, ASLey, SVMcMurray, GStorer, RI Design, Synthesis, and Evaluation of Tetrasubstituted Pyridines as Potent 5-HT2C Receptor Agonists. ACS Med Chem Lett6:329-33 (2015) 
 
5-hydroxytryptamine receptor 2C
Name:5-hydroxytryptamine receptor 2C
Type:G Protein-Coupled Receptor (GPCR)
Mol. Mass.:51836.79
Organism:Homo sapiens (Human)
Description:P28335
Residue:458
BDBM50086247
NameBDBM50086247
Synonyms:CHEMBL3425757
TypeSmall organic molecule
Emp. Form.C20H27N3
Mol. Mass.309.4485
SMILESCC(C)CNc1nc(Cc2ccccc2)cc2CCNCCc12