Reaction Details
Target5-hydroxytryptamine receptor 2C
LigandBDBM50086253
Substrate/Competitorn/a
Meas. Tech.ChEMBL_1477947 (CHEMBL936420)
Ki 35±n/a nM
Citation Rouquet, GMoore, DESpain, MAllwood, DMBattilocchio, CBlakemore, DCFish, PVJenkinson, SJessiman, ASLey, SVMcMurray, GStorer, RI Design, Synthesis, and Evaluation of Tetrasubstituted Pyridines as Potent 5-HT2C Receptor Agonists. ACS Med Chem Lett6:329-33 (2015) 
 
5-hydroxytryptamine receptor 2C
Name:5-hydroxytryptamine receptor 2C
Type:G Protein-Coupled Receptor (GPCR)
Mol. Mass.:51836.79
Organism:Homo sapiens (Human)
Description:P28335
Residue:458
BDBM50086253
NameBDBM50086253
Synonyms:CHEMBL3425763
TypeSmall organic molecule
Emp. Form.C16H18N2
Mol. Mass.238.3275
SMILESC(c1ccccc1)c1cc2CCNCCc2cn1