Reaction Details
TargetRetinoic acid receptor RXR-alpha
LigandBDBM50086256
Substrate/Competitorn/a
Meas. Tech.ChEMBL_1477955 (CHEMBL3429522)
EC50 12±n/a nM
Citation Kobayashi, TFurusawa, YYamada, SAkehi, MTakenaka, FSasaki, TAkahoshi, AHanada, TMatsuura, EHirano, HTai, AKakuta, H Positron emission tomography to elucidate pharmacokinetic differences of regioisomeric retinoid x receptor agonists. ACS Med Chem Lett6:334-8 (2015) 
 
Retinoic acid receptor RXR-alpha
Name:Retinoic acid receptor RXR-alpha
Type:PROTEIN
Mol. Mass.:50820.38
Organism:Homo sapiens (Human)
Description:ChEMBL_1456363
Residue:462
BDBM50086256
NameBDBM50086256
Synonyms:CHEMBL3425764
TypeSmall organic molecule
Emp. Form.C21H27FN2O3
Mol. Mass.374.4491
SMILESCCN(c1ccc(C(C)C)c(OCC(C)CF)c1)c1ccc(cn1)C(O)=O