Reaction Details
TargetGlucagon-like peptide 1 receptor
LigandBDBM50301953
Substrate/Competitorn/a
Meas. Tech.ChEMBL_1477109 (CHEMBL3428276)
Ki 0.660000±n/a nM
Citation Hoang, HNSong, KHill, TADerksen, DREdmonds, DJKok, WMLimberakis, CLiras, SLoria, PMMascitti, VMathiowetz, AMMitchell, JMPiotrowski, DWPrice, DAStanton, RVSuen, JYWithka, JMGriffith, DAFairlie, DP Short Hydrophobic Peptides with Cyclic Constraints Are Potent Glucagon-like Peptide-1 Receptor (GLP-1R) Agonists. J Med Chem58:4080-5 (2015) 
 
Glucagon-like peptide 1 receptor
Name:Glucagon-like peptide 1 receptor
Type:Enzyme
Mol. Mass.:53035.78
Organism:Homo sapiens (Human)
Description:P43220
Residue:463
BDBM50301953
NameBDBM50301953
Synonyms:(3S,6S,9S,12S,15S,21S)-21-(2-((S)-2-amino-3-(1H-imidazol-5-yl)propanamido)-2-methylpropanamido)-3-((S)-1-((S)-1-amino-3-(2'-methylbiphenyl-4-yl)-1-oxopropan-2-ylamino)-3-(2'-ethyl-4'-methoxybiphenyl-4-yl)-1-oxopropan-2-ylcarbamoyl)-12-(2,6-difluorobenzyl)-9,15-bis((R)-1-hydroxyethyl)-6-(hydroxymethyl)-12-methyl-5,8,11,14,17,20-hexaoxo-4,7,10,13,16,19-hexaazatetracosane-1,24-dioic acid | CHEMBL577346
TypeSmall organic molecule
Emp. Form.C76H94F2N14O19
Mol. Mass.1545.6388
SMILESCCc1cc(OC)ccc1-c1ccc(C[C@H](NC(=O)[C@H](CC(O)=O)NC(=O)[C@H](CO)NC(=O)[C@@H](NC(=O)[C@](C)(Cc2c(F)cccc2F)NC(=O)[C@@H](NC(=O)CNC(=O)[C@H](CCC(O)=O)NC(=O)C(C)(C)NC(=O)[C@@H](N)Cc2cnc[nH]2)[C@@H](C)O)[C@@H](C)O)C(=O)N[C@@H](Cc2ccc(cc2)-c2ccccc2C)C(N)=O)cc1