Reaction Details
TargetCarbonic anhydrase 9
LigandBDBM50087052
Substrate/Competitorn/a
Meas. Tech.ChEMBL_1477828 (CHEMBL3428963)
Ki 6.6±n/a nM
Citation Grandane, ATanc, MDi Cesare Mannelli, LCarta, FGhelardini, C?alubovskis, RSupuran, CT 6-Substituted sulfocoumarins are selective carbonic anhdydrase IX and XII inhibitors with significant cytotoxicity against colorectal cancer cells. J Med Chem58:3975-83 (2015) 
 
Carbonic anhydrase 9
Name:Carbonic anhydrase 9
Type:Enzyme
Mol. Mass.:49669.03
Organism:Homo sapiens (Human)
Description:Catalytic domain of human cloned isozyme was used in the assay
Residue:459
BDBM50087052
NameBDBM50087052
Synonyms:CHEMBL3426532
TypeSmall organic molecule
Emp. Form.C15H11NO4S
Mol. Mass.301.317
SMILESO=C(Nc1ccc2OS(=O)(=O)C=Cc2c1)c1ccccc1