Reaction Details
TargetPlatelet-derived growth factor receptor alpha
LigandBDBM50331095
Substrate/Competitorn/a
Meas. Tech.ChEMBL_1476220 (CHEMBL3429406)
IC50 3.3±n/a nM
Citation Guo, SPang, XPeng, LZhan, MFan, LGong, YKang, FChen, Y Design, synthesis and biological evaluation of deuterated Tivozanib for improving pharmacokinetic properties. Bioorg Med Chem Lett25:2425-8 (2015) 
 
Platelet-derived growth factor receptor alpha
Name:Platelet-derived growth factor receptor alpha
Type:Protein
Mol. Mass.:122633.38
Organism:Homo sapiens (Human)
Description:P16234
Residue:1089
BDBM50331095
NameBDBM50331095
Synonyms:CHEMBL1289494 US10464902, Tivozanib
TypeSmall organic molecule
Emp. Form.C22H19ClN4O5
Mol. Mass.454.863
SMILESCOc1cc2nccc(Oc3ccc(NC(=O)Nc4cc(C)on4)c(Cl)c3)c2cc1OC