Reaction Details
TargetScavenger receptor class B member 1
LigandBDBM50088267
Substrate/Competitorn/a
Meas. Tech.ChEMBL_1476710 (CHEMBL3429061)
IC50 27±n/a nM
Citation Dockendorff, CFaloon, PWGermain, AYu, MYoungsaye, WNag, PPBennion, MPenman, MNieland, TJDandapani, SPerez, JRMunoz, BPalmer, MASchreiber, SLKrieger, M Discovery of bisamide-heterocycles as inhibitors of scavenger receptor BI (SR-BI)-mediated lipid uptake. Bioorg Med Chem Lett25:2594-8 (2015) 
 
Scavenger receptor class B member 1
Name:Scavenger receptor class B member 1
Type:PROTEIN
Mol. Mass.:56761.39
Organism:Mus musculus
Description:ChEMBL_103999
Residue:509
BDBM50088267
NameBDBM50088267
Synonyms:CHEMBL3427489
TypeSmall organic molecule
Emp. Form.C24H32N6O4
Mol. Mass.468.5487
SMILESCC(N(C1CCCCC1)C(=O)Cn1nnc(n1)-c1ccc2OCOc2c1)C(=O)NC1CCCC1