Reaction Details
TargetScavenger receptor class B member 1
LigandBDBM50088268
Substrate/Competitorn/a
Meas. Tech.ChEMBL_1476710 (CHEMBL3429061)
IC50 130±n/a nM
Citation Dockendorff, CFaloon, PWGermain, AYu, MYoungsaye, WNag, PPBennion, MPenman, MNieland, TJDandapani, SPerez, JRMunoz, BPalmer, MASchreiber, SLKrieger, M Discovery of bisamide-heterocycles as inhibitors of scavenger receptor BI (SR-BI)-mediated lipid uptake. Bioorg Med Chem Lett25:2594-8 (2015) 
 
Scavenger receptor class B member 1
Name:Scavenger receptor class B member 1
Type:PROTEIN
Mol. Mass.:56761.39
Organism:Mus musculus
Description:ChEMBL_103999
Residue:509
BDBM50088268
NameBDBM50088268
Synonyms:CHEMBL3427488
TypeSmall organic molecule
Emp. Form.C23H31FN6O2
Mol. Mass.442.5296
SMILESCC(N(C1CCCCC1)C(=O)Cn1nnc(n1)-c1ccc(F)cc1)C(=O)NC1CCCC1