Reaction Details
TargetSodium channel protein type 5 subunit alpha
LigandBDBM50410855
Substrate/Competitorn/a
Meas. Tech.ChEMBL_1478691 (CHEMBL3430592)
IC50 16600±n/a nM
Citation Mirams, GRCui, YSher, AFink, MCooper, JHeath, BMMcMahon, NCGavaghan, DJNoble, D Simulation of multiple ion channel block provides improved early prediction of compounds' clinical torsadogenic risk. Cardiovasc Res91:53-61 (2011) 
 
Sodium channel protein type 5 subunit alpha
Name:Sodium channel protein type 5 subunit alpha
Type:Enzyme
Mol. Mass.:226908.60
Organism:Homo sapiens (Human)
Description:Q14524
Residue:2016
BDBM50410855
NameBDBM50410855
Synonyms:CIN-QUIN QUINIDINE SULFATE
TypeSmall organic molecule
Emp. Form.C20H24N2O2
Mol. Mass.324.4168
SMILESCOc1ccc2nccc([C@H](O)[C@H]3CC4CCN3C[C@@H]4C=C)c2c1