Reaction Details
TargetPotassium voltage-gated channel subfamily H member 2
LigandBDBM50318494
Substrate/Competitorn/a
Meas. Tech.ChEMBL_1478743 (CHEMBL3430644)
IC50 10000±n/a nM
Citation Mirams, GRCui, YSher, AFink, MCooper, JHeath, BMMcMahon, NCGavaghan, DJNoble, D Simulation of multiple ion channel block provides improved early prediction of compounds' clinical torsadogenic risk. Cardiovasc Res91:53-61 (2011) 
 
Potassium voltage-gated channel subfamily H member 2
Name:Potassium voltage-gated channel subfamily H member 2
Type:Multi-pass membrane protein
Mol. Mass.:126672.65
Organism:Homo sapiens (Human)
Description:Q12809
Residue:1159
BDBM50318494
NameBDBM50318494
Synonyms:3-ethyl 5-methyl 2,6-dimethyl-4-(3-nitrophenyl)-1,4-dihydropyridine-3,5-dicarboxylate NITRENDIPINE | cid_4507
TypeSmall organic molecule
Emp. Form.C18H20N2O6
Mol. Mass.360.3612
SMILESCCOC(=O)C1=C(C)N=C(C)C(C1c1cccc(c1)[N+]([O-])=O)C(=O)OC