Reaction Details
TargetPotassium voltage-gated channel subfamily H member 2
LigandBDBM50088367
Substrate/Competitorn/a
Meas. Tech.ChEMBL_1478753 (CHEMBL3430654)
IC50 2500±n/a nM
Citation Mirams, GRCui, YSher, AFink, MCooper, JHeath, BMMcMahon, NCGavaghan, DJNoble, D Simulation of multiple ion channel block provides improved early prediction of compounds' clinical torsadogenic risk. Cardiovasc Res91:53-61 (2011) 
 
Potassium voltage-gated channel subfamily H member 2
Name:Potassium voltage-gated channel subfamily H member 2
Type:Multi-pass membrane protein
Mol. Mass.:126672.65
Organism:Homo sapiens (Human)
Description:Q12809
Residue:1159
BDBM50088367
NameBDBM50088367
Synonyms:Tedisamil
TypeSmall organic molecule
Emp. Form.C19H32N2
Mol. Mass.288.4708
SMILESC(C1CC1)N1CC2CN(CC3CC3)CC(C1)C21CCCC1