Reaction Details
TargetCytochrome P450 2C8
LigandBDBM50088489
Substrate/Competitorn/a
Meas. Tech.ChEMBL_1486254 (CHEMBL3534692)
Ki 31700±n/a nM
Citation Foti, RSPearson, JTWong, SLZalikowski, JABoudreaux, MDProkop, SPDavis, JABanfield, CEmery, MGRock, DAWahlstrom, JLWienkers, LCAmore, BM Predicting the drug interaction potential of AMG 853, a dual antagonist of the D-prostanoid and chemoattractant receptor-homologous molecule expressed on T helper 2 cells receptors. Drug Metab Dispos40:2239-49 (2012) 
 
Cytochrome P450 2C8
Name:Cytochrome P450 2C8
Type:Protein
Mol. Mass.:55839.23
Organism:Homo sapiens (Human)
Description:P10632
Residue:490
BDBM50088489
NameBDBM50088489
Synonyms:CHEMBL3527324
TypeSmall organic molecule
Emp. Form.C28H27Cl2FN2O7S
Mol. Mass.625.493
SMILESCC(C)(CO)NC(=O)c1ccc(Oc2cc(F)c(CC(O)=O)cc2Cl)c(NS(=O)(=O)c2ccc(cc2Cl)C2CC2)c1