Reaction Details
TargetCytochrome P450 2C8
LigandBDBM50088490
Substrate/Competitorn/a
Meas. Tech.ChEMBL_1487049 (CHEMBL3532219)
Ki 6900±n/a nM
Citation Foti, RSPearson, JTWong, SLZalikowski, JABoudreaux, MDProkop, SPDavis, JABanfield, CEmery, MGRock, DAWahlstrom, JLWienkers, LCAmore, BM Predicting the drug interaction potential of AMG 853, a dual antagonist of the D-prostanoid and chemoattractant receptor-homologous molecule expressed on T helper 2 cells receptors. Drug Metab Dispos40:2239-49 (2012) 
 
Cytochrome P450 2C8
Name:Cytochrome P450 2C8
Type:Protein
Mol. Mass.:55839.23
Organism:Homo sapiens (Human)
Description:P10632
Residue:490
BDBM50088490
NameBDBM50088490
Synonyms:CHEMBL3526979
TypeSmall organic molecule
Emp. Form.C34H35Cl2FN2O12S
Mol. Mass.785.617
SMILESCC(C)(C)NC(=O)c1ccc(Oc2cc(F)c(CC(=O)O[C@@H]3O[C@@H]([C@@H](O)[C@H](O)[C@H]3O)C(O)=O)cc2Cl)c(NS(=O)(=O)c2ccc(cc2Cl)C2CC2)c1