Reaction Details
TargetATP-binding cassette sub-family C member 2
LigandBDBM50088505
Substrate/Competitorn/a
Meas. Tech.ChEMBL_1491711 (CHEMBL3536903)
IC50 50000±n/a nM
Citation Gao, CZhang, HGuo, ZYou, TChen, XZhong, D Mechanistic studies on the absorption and disposition of scutellarin in humans: selective OATP2B1-mediated hepatic uptake is a likely key determinant for its unique pharmacokinetic characteristics. Drug Metab Dispos40:2009-20 (2012) 
 
ATP-binding cassette sub-family C member 2
Name:ATP-binding cassette sub-family C member 2
Type:Protein
Mol. Mass.:174229.45
Organism:Homo sapiens (Human)
Description:Q92887
Residue:1545
BDBM50088505
NameBDBM50088505
Synonyms:CHEMBL3542370
TypeSmall organic molecule
Emp. Form.C21H18O12
Mol. Mass.462.3604
SMILESO[C@H]1[C@H](Oc2c(O)cc3oc(cc(=O)c3c2O)-c2ccc(O)cc2)O[C@@H]([C@@H](O)[C@@H]1O)C(O)=O