Reaction Details
TargetCytochrome P450 2C9
LigandBDBM50088506
Substrate/Competitorn/a
Meas. Tech.ChEMBL_1486161 (CHEMBL3533280)
IC50>10000±n/a nM
Citation Wang, ZYang, JKirk, CFang, YAlsina, MBadros, APapadopoulos, KWong, AWoo, TBomba, DLi, JInfante, JR Clinical pharmacokinetics, metabolism, and drug-drug interaction of carfilzomib. Drug Metab Dispos41:230-7 (2012) 
 
Cytochrome P450 2C9
Name:Cytochrome P450 2C9
Type:Enzyme
Mol. Mass.:55636.33
Organism:Homo sapiens (Human)
Description:P11712
Residue:490
BDBM50088506
NameBDBM50088506
Synonyms:CHEMBL3542249
TypeSmall organic molecule
Emp. Form.C40H57N5O7
Mol. Mass.719.9099
SMILESCC(C)CC(NC(=O)C(CCc1ccccc1)NC(=O)CN1CCOCC1)C(=O)NC(Cc1ccccc1)C(=O)NC(CC(C)C)C(=O)C1(C)CO1