Reaction Details
TargetUDP-glucuronosyltransferase 1A1
LigandBDBM23450
Substrate/Competitorn/a
Meas. Tech.ChEMBL_1486476 (CHEMBL3531466)
IC50 280000±n/a nM
Citation Zhou, JTracy, TSRemmel, RP Correlation between bilirubin glucuronidation and estradiol-3-gluronidation in the presence of model UDP-glucuronosyltransferase 1A1 substrates/inhibitors. Drug Metab Dispos39:322-9 (2011) 
 
UDP-glucuronosyltransferase 1A1
Name:UDP-glucuronosyltransferase 1A1
Type:Enzyme
Mol. Mass.:59604.34
Organism:Homo sapiens (Human)
Description:P22309
Residue:533
BDBM23450
NameBDBM23450
Synonyms:1-Naphthalenol CHEMBL122617 alpha-naphthol | naphthalen-1-ol
TypeSmall organic molecule
Emp. Form.C10H8O
Mol. Mass.144.1699
SMILESOc1cccc2ccccc12