Reaction Details
TargetUDP-glucuronosyltransferase 1A1
LigandBDBM50088507
Substrate/Competitorn/a
Meas. Tech.ChEMBL_1486476 (CHEMBL3531466)
IC50 110000±n/a nM
Citation Zhou, JTracy, TSRemmel, RP Correlation between bilirubin glucuronidation and estradiol-3-gluronidation in the presence of model UDP-glucuronosyltransferase 1A1 substrates/inhibitors. Drug Metab Dispos39:322-9 (2011) 
 
UDP-glucuronosyltransferase 1A1
Name:UDP-glucuronosyltransferase 1A1
Type:Enzyme
Mol. Mass.:59604.34
Organism:Homo sapiens (Human)
Description:P22309
Residue:533
BDBM50088507
NameBDBM50088507
Synonyms:CHEBI:63804 | CHEMBL1908021
TypeSmall organic molecule
Emp. Form.C15H12N2O3
Mol. Mass.268.2674
SMILESOc1ccc(cc1)C1(NC(=O)NC1=O)c1ccccc1