Reaction Details
TargetUDP-glucuronosyltransferase 1A1
LigandBDBM30705
Substrate/Competitorn/a
Meas. Tech.ChEMBL_1486475 (CHEMBL3531465)
IC50 180000±n/a nM
Citation Zhou, JTracy, TSRemmel, RP Correlation between bilirubin glucuronidation and estradiol-3-gluronidation in the presence of model UDP-glucuronosyltransferase 1A1 substrates/inhibitors. Drug Metab Dispos39:322-9 (2011) 
 
UDP-glucuronosyltransferase 1A1
Name:UDP-glucuronosyltransferase 1A1
Type:Enzyme
Mol. Mass.:59604.34
Organism:Homo sapiens (Human)
Description:P22309
Residue:533
BDBM30705
NameBDBM30705
Synonyms:CHEMBL744 RILUZOLE cid_5070
TypeSmall organic molecule
Emp. Form.C8H5F3N2OS
Mol. Mass.234.198
SMILESNc1nc2ccc(OC(F)(F)F)cc2s1