Reaction Details
TargetProstaglandin E synthase
LigandBDBM50088509
Substrate/Competitorn/a
Meas. Tech.ChEMBL_1484139 (CHEMBL3537145)
IC50>2000±n/a nM
Citation Bylund, JAnnas, AHellgren, DBjurström, SAndersson, HSvanhagen, A Amide hydrolysis of a novel chemical series of microsomal prostaglandin E synthase-1 inhibitors induces kidney toxicity in the rat. Drug Metab Dispos41:634-41 (2013) 
 
Prostaglandin E synthase
Name:Prostaglandin E synthase
Type:Protein
Mol. Mass.:17112.22
Organism:Homo sapiens (Human)
Description:n/a
Residue:152
BDBM50088509
NameBDBM50088509
Synonyms:CHEMBL3527201
TypeSmall organic molecule
Emp. Form.C21H21F3N2O6S2
Mol. Mass.518.526
SMILESCC(C)C#Cc1ccc(cc1OCCC(F)(F)F)C(=O)NS(=O)(=O)c1ccccc1S(N)(=O)=O